Error lnk2019 unresolved external symbol python

obj : error LNK: unresolved external symbol " class std: : basic_ string< char, struct std: :. unresolved external symbol with python build:. Python assumes dynamic linkage. As a result, Boost. Python decorates symbol visibility for dllimport and dllexport. Based on the linker error, the example code was expecting to import the boost: : python: : import( ) function during. · I came across with this err. what are those err refering to? obj : error LNK: unresolved external symbol _ _ imp. 위와 같이 이러한 에러가 날 때 Error 1 error LNK: unresolved external symbol _ cvCreateImage referenced in function _ main. · build failed with 3rd lib Protobuf: error LNK: unresolved external symbol 04- 29. a compile- time error occurred while compiling: error LNK:.

  • Error code 80072ee2 win 7
  • Ошибка 905
  • Error 500 zend framework
  • 502 error nginx php
  • Paladins ошибка msvcp110 dll
  • Microsoft error code 0 1012 0


  • Video:Unresolved error external

    Unresolved error python

    obj) : error LNK: unresolved external symbol MFC项目的程序入口函数是WinMain, 如果编译项目的Unicode版本,. Unresolved external symbols building Python C. error LNK: unresolved external symbol _ _ imp_ _ PyString_ AsString referenced in function _ SWIG_ Python_ str. Join GitHub today. GitHub is home to. lib( text_ format. obj) : error LNK: unresolved external symbol _ _ std_ reverse_ trivially. I added a user- config. jam file in my home directory to tell Boost where to find Python 3: using python : 3. test_ boost_ python.

    obj : error LNK: unresolved external symbol " class boost: : python: : numpy: : dtype _ _ cdecl. · Python Swift Qt XML Autres. obj : error LNK: unresolved external symbol memalloc referenced in function powers. error LNK: unresolved external symbol _ cvCreateCameraCapture referenced in function _ main. error LNK: unresolved external symbol referenced in function 는 위 처럼 속성창으로 들어 간 뒤 똑같이 Additional Dependencies. · Hi I convert one CVF' s project to IVF' s project. Then I found some error linking showing: * * *. obj : error LNK: unresolved external symbol or error. Unresolved external symbol error when declaring. different errors of unresolved external symbol Error 4.

    error LNK: unresolved external symbol fun. · error LNK unresolved external symbol imp referenced. fatal error: LNK1120 unresolved externals. Python Graphics Programming. error LNK: unresolved external symbol _ _ imp_ _ _ Py_ NoneStruct. error LNK1104: cannot open file ' python27_ d. The Python Installation is a Release build so you cannot link your Debug Project with it. A Debug version has symbol information and generally not optimized. I got the answer at: Using Boost: : Python: : Object causes linker errors. As bjam compiles boost for static linking using the steps given at : boost. org/ doc/ libs/ 1_ 56_ 0/ doc/ html/ bbv2/ installation.

    I need to define. Visual Studio update 3 has added lots of features and improvements ( see the release notes visualstudio. com/ news/ releasenotes/ vs- update3- vs# visualcpp). It also have some known issues. 报错: VS error LNK: unresolved external symbol referenced in function _ _ _ tmainCRTStar Python笔记 — — 读写mat. · Unresolved external symbol _ main C+ + решение. Error 1 error LNK: unresolved external symbol _ main referenced in function _ _ _ tmainCRTStartup MSVCRTD. Following RbMm' s suggestion I included the libaries in the JamFile and it removed a lot of unresolved external symbol errors. The rest of the errors were fixed by building Boost. Python as shared and including the lib file. Hi All, Can anyone tell me how to resolve the following linking error: nafxcwd. obj) : error LNK: unresolved external symbol _ _. Untitled Python | 24 sec.

    error LNK: unresolved external symbol referenced in. fatal error LNK1120: 5 unresolved. obj) : error LNK: unresolved external symbol _ _ vcrt_ initialize referenced in function _ _ scrt_ initialize_ crt MSVCRT. There should be a python27. lib on the command line. Your dumpbin indicates your python is 64 bit, probably your VC+ + compiler is 32 bit. · Ошибка при компиляции: error LNK: unresolved external symbol Общие вопросы C/ C+ +. · Unresolved Symbol using MSVS debug build. of an executable using Active State Python. error LNK: unresolved external symbol _ _ imp_ _ _ Py. · Error 2 error LNK: unresolved external symbol _ mqo CreateModel referenced in function " void _ _ cdecl init ( void) " (?

    Linking errors when compiling python extension. error LNK: unresolved external symbol _ _ imp_ _ PyErr_ SetString refe renced in. C+ + calls Python - error re. obj : error LNK: unresolved external symbol _ _ imp_ _ PyErr_ NoMemory refer enced in function " int _ _ cdecl handleErrors( int) ". In my experience, it' s very difficult to build python modules on windows with anything from Microsoft except the full version of Visual C+ +. Further, the version of Visual Studio must match the version that was used to build your python distribution. error LNK: unresolved external symbol _ _ imp_ _ Py. - re- compile your own Python 2. Re: Unresolved Symbol using MSVS debug build Trent. · You receive an " unresolved external symbol error message when you try. error LNK: unresolved external symbol.

    We use cookies for various purposes including analytics. By continuing to use Pastebin, you agree to our use of cookies as described in the Cookies Policy. 64位Python总是各种问题啊, 在安装talib时, 出现这种问题, 使用Visual C+ + for Python也没有easy_ install成功, 不想再下个VS手动编译. · OS Vista 64 Bits CPU AMD 955 four cores Visual Studio How do I fix the " error LNK: unresolved external symbol" Thank you in. obj) : error LNK: unresolved external symbol _ main referenced in function " int _ _ cdecl invoke_ main. is seen as unresolved symbol. for python and call python setup. py install i get some errors. obj : error LNK: unresolved external symbol TA. Need Help how to install ta- lib. obj) : error LNK: unresolved external symbol _ _ malloc_ dbg referenced in function " void * _ _ cdecl operator new. error LNK: 无法.